Talk:Reiser4

From ArchWiki
Revision as of 05:02, 28 August 2012 by Fengchao (Talk | contribs) (Rewrite: Remove old log.)

Jump to: navigation, search

idea behind this article?

what do we want to explain with this article? how reiserfs4 works? where does it belong?

  • System Maintaince?
  • System Configuration?
  • Installation?

--Dp 08:37, 30 Jul 2005 (EDT)

PKGBUILDs

  • Why are we still showing PKGBUILDs for this stuff here? It's been in [community] and the AUR since just about day 1. --Neotuli 22:19, 14 Aug 2005 (EDT)
    • i think we can edit this to mention where the packages are instead of having PKGBUILD's - feel free to edit removing the PKGBUILD and mentioning where it can be found --Dp 14:20, 15 Aug 2005 (EDT)
    • because if there is a newer version, you can compile it youre self. --Xerverius 14:30 6 dec 2005


  • As of 12/06/2007, it doesn't compile for me (an absolute newbie to arch, coming from gentoo). Changed the md5's in the PKGBUILD, but I get a big error:

fsys_reiser4.c: In function 'reiser4_read': fsys_reiser4.c:126: warning: implicit declaration of function 'objplug' fsys_reiser4.c:126: error: invalid type argument of '->' fsys_reiser4.c:127: warning: implicit declaration of function 'plug_call' fsys_reiser4.c:127: error: invalid type argument of '->' fsys_reiser4.c:128: error: 'seek' undeclared (first use in this function) fsys_reiser4.c:128: error: (Each undeclared identifier is reported only once fsys_reiser4.c:128: error: for each function it appears in.) fsys_reiser4.c:128: error: 'reiser4_object_t' has no member named 'ent' fsys_reiser4.c:133: error: invalid type argument of '->' fsys_reiser4.c:134: error: invalid type argument of '->' fsys_reiser4.c:135: error: 'reiser4_object_t' has no member named 'ent' fsys_reiser4.c: In function 'reiser4_dir': fsys_reiser4.c:155: error: invalid type argument of '->' fsys_reiser4.c:156: error: 'close' undeclared (first use in this function) fsys_reiser4.c:156: error: 'reiser4_object_t' has no member named 'ent' fsys_reiser4.c:195: error: 'reiser4_object_t' has no member named 'ent' fsys_reiser4.c:195: error: 'OPSET_OBJ' undeclared (first use in this function) fsys_reiser4.c:202: error: invalid type argument of '->' fsys_reiser4.c:203: error: 'reiser4_object_t' has no member named 'ent' fsys_reiser4.c:209: error: invalid type argument of '->' fsys_reiser4.c:210: error: invalid type argument of '->' fsys_reiser4.c:210: error: 'readdir' undeclared (first use in this function) fsys_reiser4.c:211: error: 'reiser4_object_t' has no member named 'ent' fsys_reiser4.c:233: error: 'reiser4_object_t' has no member named 'ent' make[2]: *** [pre_stage2_exec-fsys_reiser4.o] Error 1 make[2]: Leaving directory `/var/abs/local/grub/src/grub-0.97/stage2' make[1]: *** [all-recursive] Error 1 make[1]: Leaving directory `/var/abs/local/grub/src/grub-0.97' make: *** [all] Error 2 ==> ERROR: Build Failed. Aborting...

Any suggestions will be very apreciated, as by circunstances I only have the chance (right now, without tossing out a LOT of data) of installing in a reiser4 root, and I am not familiar at all with lilo.

--Jisakiel